Target
Monoglyceride lipase
Ligand
BDBM444464
Substrate
Meas. Tech.
Fluorescent Assay
IC50
55±n/a nM
Citation
 Makriyannis, AMalamas, MLamani, MFarah, SI ABHD6 and dual ABHD6/MGL inhibitors and their uses US Patent  US10662159 Publication Date 5/26/2020 
Target
Name:
Monoglyceride lipase
Synonyms:
HU-K5 Lysophospholipase-like MGL MGLL_HUMAN
Type:
Hydrolase
Mol. Mass.:
33264.56
Organism:
Homo sapiens (Human)
Description:
Human recombinant MGL (Cayman Chemical, cat# 10008354).
Residue:
303
  
Inhibitor
Name:
BDBM444464
Synonyms:
US10662159, Example 53
Type:
Small organic molecule
Emp. Form.:
C16H14F7NO3
Mol. Mass.:
401.2761
SMILES:
Fc1cccc(OC2CC3(C2)CN(C3)C(=O)OC(C(F)(F)F)C(F)(F)F)c1
: