Target
Sodium channel protein type 8 subunit alpha
Ligand
BDBM373799
Substrate
Meas. Tech.
Electrophysiological Assay
IC50
144±n/a nM
Citation
 Andrez, JBurford, KNChowdhury, SCohen, CJDehnhardt, CMDevita, RJEmpfield, JRFocken, TGrimwood, MEHasan, SAJohnson, Jr., JPZenova, AY Benzenesulfonamide compounds and their use as therapeutic agents US Patent  US10662184 Publication Date 5/26/2020 
Target
Name:
Sodium channel protein type 8 subunit alpha
Synonyms:
MED SCN8A_HUMAN Sodium channel protein type 8 subunit alpha Voltage-gated sodium channel subunit alpha Nav1.6 | ep nav1.6
Type:
PROTEIN
Mol. Mass.:
225271.59
Organism:
Homo sapiens (Human)
Description:
ChEMBL_1516902
Residue:
1980
  
Inhibitor
Name:
BDBM373799
Synonyms:
(R)-4-((1-benzylpyrrolidin-3-yl)amino)-3-chloro-N-(1,2,4-thiadiazol-5-yl)benzenesulfonamide 2,2,2-trifluoroacetate US10662184, Example 66 US11299490, Example 66
Type:
Small organic molecule
Emp. Form.:
C19H20ClN5O2S2
Mol. Mass.:
449.977
SMILES:
Clc1cc(ccc1N[C@@H]1CCN(Cc2ccccc2)C1)S(=O)(=O)Nc1ncns1
: