Target
Fibroblast growth factor receptor 2
Ligand
BDBM161401
Substrate
Meas. Tech.
FGFR2 Kinase Activity
IC50
3.80±n/a nM
Citation
 Sootome, H Therapeutic agent for FGFR inhibitor-resistant cancer US Patent  US10124003 Publication Date 11/13/2018 
Target
Name:
Fibroblast growth factor receptor 2
Synonyms:
BEK FGFR-2 FGFR2 Fibroblast growth factor receptor 2 (FGFR2) KGFR Keratinocyte growth factor receptor VEGF-receptor 2 and Fibroblast growth factor receptor 2
Type:
Enzyme
Mol. Mass.:
92015.45
Organism:
Homo sapiens (Human)
Description:
P21802
Residue:
821
  
Inhibitor
Name:
BDBM161401
Synonyms:
US10124003, Ex. Compound 14 US10894048, Ex Comp 14 | US9108973, 14
Type:
Small organic molecule
Emp. Form.:
C25H29N7O3
Mol. Mass.:
475.5429
SMILES:
COc1cc(OC)cc(c1)C#Cc1nn(C2CN(C2)C(=O)\C=C\CNC(C)C)c2ncnc(N)c12
: