Target
Fibroblast growth factor receptor 2
Ligand
BDBM161427
Substrate
Meas. Tech.
FGFR2 Kinase Activity
IC50
3.20±n/a nM
Citation
 Sootome, H Therapeutic agent for FGFR inhibitor-resistant cancer US Patent  US10124003 Publication Date 11/13/2018 
Target
Name:
Fibroblast growth factor receptor 2
Synonyms:
BEK FGFR-2 FGFR2 Fibroblast growth factor receptor 2 (FGFR2) KGFR Keratinocyte growth factor receptor VEGF-receptor 2 and Fibroblast growth factor receptor 2
Type:
Enzyme
Mol. Mass.:
92015.45
Organism:
Homo sapiens (Human)
Description:
P21802
Residue:
821
  
Inhibitor
Name:
BDBM161427
Synonyms:
US10124003, Ex. Compound 40 US10894048, Ex Comp 40 | US9108973, 40
Type:
Small organic molecule
Emp. Form.:
C28H32N6O3
Mol. Mass.:
500.5921
SMILES:
COc1cc(OC)cc(c1)C#Cc1cn([C@H]2CCN(C2)C(=O)\C=C\CN2CCCC2)c2ncnc(N)c12
: