Target
Fibroblast growth factor receptor 2
Ligand
BDBM161444
Substrate
Meas. Tech.
FGFR2 Kinase Activity
IC50
1.50±n/a nM
Citation
 Sootome, H Therapeutic agent for FGFR inhibitor-resistant cancer US Patent  US10124003 Publication Date 11/13/2018 
Target
Name:
Fibroblast growth factor receptor 2
Synonyms:
BEK FGFR-2 FGFR2 Fibroblast growth factor receptor 2 (FGFR2) KGFR Keratinocyte growth factor receptor VEGF-receptor 2 and Fibroblast growth factor receptor 2
Type:
Enzyme
Mol. Mass.:
92015.45
Organism:
Homo sapiens (Human)
Description:
P21802
Residue:
821
  
Inhibitor
Name:
BDBM161444
Synonyms:
US10124003, Ex. Compound 57 US10894048, Ex Comp 57 | US9108973, 57
Type:
Small organic molecule
Emp. Form.:
C26H30N6O3
Mol. Mass.:
474.5548
SMILES:
COc1cc(OC)cc(c1)C#Cc1cn(C2CN(C2)C(=O)\C=C\CNC(C)C)c2ncnc(N)c12
: