Target
Fibroblast growth factor receptor 2
Ligand
BDBM298389
Substrate
Meas. Tech.
FGFR2 Kinase Activity
IC50
4.90±n/a nM
Citation
 Sootome, H Therapeutic agent for FGFR inhibitor-resistant cancer US Patent  US10124003 Publication Date 11/13/2018 
Target
Name:
Fibroblast growth factor receptor 2
Synonyms:
BEK FGFR-2 FGFR2 Fibroblast growth factor receptor 2 (FGFR2) KGFR Keratinocyte growth factor receptor VEGF-receptor 2 and Fibroblast growth factor receptor 2
Type:
Enzyme
Mol. Mass.:
92015.45
Organism:
Homo sapiens (Human)
Description:
P21802
Residue:
821
  
Inhibitor
Name:
BDBM298389
Synonyms:
US10124003, Ex. Compound 73 | US10835536, Ex. Comp 73
Type:
Small organic molecule
Emp. Form.:
C24H24N4O3
Mol. Mass.:
416.4724
SMILES:
COc1cc(OC)cc(c1)C#Cc1cn([C@H]2CCN(C2)C(=O)C=C)c2ccnc(N)c12
: