Target
Fibroblast growth factor receptor 2
Ligand
BDBM161461
Substrate
Meas. Tech.
FGFR2 Kinase Activity
IC50
270±n/a nM
Citation
 Sootome, H Therapeutic agent for FGFR inhibitor-resistant cancer US Patent  US10124003 Publication Date 11/13/2018 
Target
Name:
Fibroblast growth factor receptor 2
Synonyms:
BEK FGFR-2 FGFR2 Fibroblast growth factor receptor 2 (FGFR2) KGFR Keratinocyte growth factor receptor VEGF-receptor 2 and Fibroblast growth factor receptor 2
Type:
Enzyme
Mol. Mass.:
92015.45
Organism:
Homo sapiens (Human)
Description:
P21802
Residue:
821
  
Inhibitor
Name:
BDBM161461
Synonyms:
US10124003, Ref. Ex. Compound 2 US10894048, Ref. Ex Comp. 2 | US9108973, Ref 2
Type:
Small organic molecule
Emp. Form.:
C18H16N4
Mol. Mass.:
288.3464
SMILES:
Nc1nccn2c(nc(C#Cc3ccccc3)c12)C1CCC1
: