Target
Fibroblast growth factor receptor 2
Ligand
BDBM161464
Substrate
Meas. Tech.
FGFR2 Kinase Activity
IC50
190±n/a nM
Citation
 Sootome, H Therapeutic agent for FGFR inhibitor-resistant cancer US Patent  US10124003 Publication Date 11/13/2018 
Target
Name:
Fibroblast growth factor receptor 2
Synonyms:
BEK FGFR-2 FGFR2 Fibroblast growth factor receptor 2 (FGFR2) KGFR Keratinocyte growth factor receptor VEGF-receptor 2 and Fibroblast growth factor receptor 2
Type:
Enzyme
Mol. Mass.:
92015.45
Organism:
Homo sapiens (Human)
Description:
P21802
Residue:
821
  
Inhibitor
Name:
BDBM161464
Synonyms:
US10124003, Ref. Ex. Compound 5 US10894048, Ref. Ex Comp. 5 | US9108973, Ref 5
Type:
Small organic molecule
Emp. Form.:
C24H27N7O2
Mol. Mass.:
445.5169
SMILES:
COc1cccc(c1)C#Cc1nn([C@H]2CCN(C2)C(=O)\C=C\CN(C)C)c2ncnc(N)c12
: