Target
Beta-secretase 1
Ligand
BDBM116229
Substrate
Meas. Tech.
Inhibition Assay
IC50
2600±n/a nM
Citation
 Badiger, SChebrolu, MHurth, KJacquier, SLueoend, RMMachauer, RRueeger, HTintelnot-Blomley, MVeenstra, SJVoegtle, M Heterocyclic derivatives and their use in the treatment of neurological disorders US Patent  US10683287 Publication Date 6/16/2020 
Target
Name:
Beta-secretase 1
Synonyms:
ASP2 Aspartyl protease 2 BACE1 Beta-secretase (BACE) Beta-secretase 1 (BACE 1) Beta-secretase 1 (BACE1) Beta-site amyloid precursor protein cleaving enzyme 1 Memapsin-2 beta-Secretase (BACE-1) | beta-Secretase (BACE1)
Type:
Protein
Mol. Mass.:
55755.10
Organism:
Homo sapiens (Human)
Description:
P56817
Residue:
501
  
Inhibitor
Name:
BDBM116229
Synonyms:
US10683287, Example 3 | US8637508, 3
Type:
Small organic molecule
Emp. Form.:
C16H16ClFN5O2
Mol. Mass.:
364.781
SMILES:
[NH3+]C1=NC(CF)(COC1)c1cccc(NC(=O)c2ccc(Cl)cn2)n1
: