Target
Vascular endothelial growth factor receptor 2
Ligand
BDBM365337
Substrate
Meas. Tech.
VEGFR2 Kinase Assay
IC50
224±n/a nM
Citation
 Boral, SMalone, TCWang, S Pyridyl benzothiophenes as kinase inhibitors US Patent  US10669265 Publication Date 6/2/2020 
Target
Name:
Vascular endothelial growth factor receptor 2
Synonyms:
CD_antigen=CD309 Fetal liver kinase 1 (FLK-1) KDR Protein-tyrosine kinase receptor Flk-1 VEGFR-2 VEGFR2 Vascular Endothelial Growth Factor Receptor Kinase 2 Vascular endothelial growth factor receptor 2 (KDR) Vascular endothelial growth factor receptor 2 (VEGFR2) Vascular endothelial growth factor receptor-2 (VEGFR-2)
Type:
Receptor Tyrosine Kinase
Mol. Mass.:
151510.97
Organism:
Homo sapiens (Human)
Description:
P35968
Residue:
1356
  
Inhibitor
Name:
BDBM365337
Synonyms:
6-amino-5-[5-[5 (benzoylamino)-1-benzothien- 2-yl]nicotinate US10669265, Example 42 | US9868726, Example 42
Type:
Small organic molecule
Emp. Form.:
C22H17N3O3S
Mol. Mass.:
403.454
SMILES:
COC(=O)c1cnc(N)c(c1)-c1cc2cc(NC(=O)c3ccccc3)ccc2s1
: