Target
Ataxin-1
Ligand
BDBM446126
Substrate
Meas. Tech.
Human ATX Enzyme Inhibition Assay
IC50
5.00±n/a nM
Citation
 Hert, JHunziker, DMattei, PMauser, HTang, GWang, L Bicyclic derivatives US Patent  US10669268 Publication Date 6/2/2020 
Target
Name:
Ataxin-1
Synonyms:
ATX1 ATXN1 | SCA1
Type:
Protein
Mol. Mass.:
86941.25
Organism:
Homo sapiens (Human)
Description:
P54253
Residue:
815
  
Inhibitor
Name:
BDBM446126
Synonyms:
(E)-1-[(3aS,8aR)-2-((R)-4,5,6,7-tetrahydro-1H-benzotriazole-5-carbonyl)-octahydro-pyrrolo[3,4-d]azepin-6-yl]-3-(4-trifluoromethoxy-phenyl)-prop-2-en-1-one | US10669268, Example 1.21
Type:
Small organic molecule
Emp. Form.:
C25H28F3N5O3
Mol. Mass.:
503.5167
SMILES:
FC(F)(F)Oc1ccc(\C=C\C(=O)N2CC[C@@H]3CN(C[C@@H]3CC2)C(=O)[C@@H]2CCc3[nH]nnc3C2)cc1
: