Target
Ataxin-1
Ligand
BDBM446160
Substrate
Meas. Tech.
Human ATX Enzyme Inhibition Assay
IC50
4.00±n/a nM
Citation
 Hert, JHunziker, DMattei, PMauser, HTang, GWang, L Bicyclic derivatives US Patent  US10669268 Publication Date 6/2/2020 
Target
Name:
Ataxin-1
Synonyms:
ATX1 ATXN1 | SCA1
Type:
Protein
Mol. Mass.:
86941.25
Organism:
Homo sapiens (Human)
Description:
P54253
Residue:
815
  
Inhibitor
Name:
BDBM446160
Synonyms:
(3aS,6aR)-5-(1H-benzotriazole-5-carbonyl)-hexahydro-pyrrolo[3,4-c]pyrrole-2-carboxylic acid 3-chloro-5-trifluoromethoxy-benzyl ester | US10669268, Example 4.27
Type:
Small organic molecule
Emp. Form.:
C22H19ClF3N5O4
Mol. Mass.:
509.866
SMILES:
FC(F)(F)Oc1cc(Cl)cc(COC(=O)N2C[C@H]3CN(C[C@H]3C2)C(=O)c2ccc3[nH]nnc3c2)c1
: