Target
Ataxin-1
Ligand
BDBM446180
Substrate
Meas. Tech.
Human ATX Enzyme Inhibition Assay
IC50
2.00±n/a nM
Citation
 Hert, JHunziker, DMattei, PMauser, HTang, GWang, L Bicyclic derivatives US Patent  US10669268 Publication Date 6/2/2020 
Target
Name:
Ataxin-1
Synonyms:
ATX1 ATXN1 | SCA1
Type:
Protein
Mol. Mass.:
86941.25
Organism:
Homo sapiens (Human)
Description:
P54253
Residue:
815
  
Inhibitor
Name:
BDBM446180
Synonyms:
US10669268, Example 8.01
Type:
Small organic molecule
Emp. Form.:
C24H27F3N6O3
Mol. Mass.:
504.5048
SMILES:
FC(F)(F)Oc1ccc(\C=C\C(=O)N2CC[C@@H]3CN(C[C@@H]3CC2)C(=O)N2CCc3[nH]nnc3C2)cc1
: