Target
Ataxin-1
Ligand
BDBM446141
Substrate
Meas. Tech.
Human ATX Enzyme Inhibition Assay
IC50
5.00±n/a nM
Citation
 Hert, JHunziker, DMattei, PMauser, HTang, GWang, L Bicyclic derivatives US Patent  US10669268 Publication Date 6/2/2020 
Target
Name:
Ataxin-1
Synonyms:
ATX1 ATXN1 | SCA1
Type:
Protein
Mol. Mass.:
86941.25
Organism:
Homo sapiens (Human)
Description:
P54253
Residue:
815
  
Inhibitor
Name:
BDBM446141
Synonyms:
US10669268, Example 12B cis-3,5-dichlorobenzyl 5-(1H-benzo[d][1,2,3]triazole-5-carbonyl)hexahydro-1H-pyrrolo[3,4-c]pyridine-2(3H)-carboxylate
Type:
Small organic molecule
Emp. Form.:
C22H21Cl2N5O3
Mol. Mass.:
474.34
SMILES:
Clc1cc(Cl)cc(COC(=O)N2C[C@@H]3CCN(C[C@@H]3C2)C(=O)c2ccc3[nH]nnc3c2)c1
: