Target
Ataxin-1
Ligand
BDBM446239
Substrate
Meas. Tech.
Human ATX Enzyme Inhibition Assay
IC50
3.00±n/a nM
Citation
 Hert, JHunziker, DMattei, PMauser, HTang, GWang, L Bicyclic derivatives US Patent  US10669268 Publication Date 6/2/2020 
Target
Name:
Ataxin-1
Synonyms:
ATX1 ATXN1 | SCA1
Type:
Protein
Mol. Mass.:
86941.25
Organism:
Homo sapiens (Human)
Description:
P54253
Residue:
815
  
Inhibitor
Name:
BDBM446239
Synonyms:
US10669268, Example 15.34
Type:
Small organic molecule
Emp. Form.:
C25H23FN6O2
Mol. Mass.:
458.4875
SMILES:
Fc1cc(ccc1\C=C\C(=O)N1CC[C@@H]2CN(C[C@@H]2CC1)C(=O)c1ccc2[nH]nnc2c1)C#N
: