Target
Ataxin-1
Ligand
BDBM446241
Substrate
Meas. Tech.
Human ATX Enzyme Inhibition Assay
IC50
3.00±n/a nM
Citation
 Hert, JHunziker, DMattei, PMauser, HTang, GWang, L Bicyclic derivatives US Patent  US10669268 Publication Date 6/2/2020 
Target
Name:
Ataxin-1
Synonyms:
ATX1 ATXN1 | SCA1
Type:
Protein
Mol. Mass.:
86941.25
Organism:
Homo sapiens (Human)
Description:
P54253
Residue:
815
  
Inhibitor
Name:
BDBM446241
Synonyms:
US10669268, Example 15.36
Type:
Small organic molecule
Emp. Form.:
C23H21F2N5O3
Mol. Mass.:
453.4413
SMILES:
FC(F)Oc1ccc(\C=C\C(=O)N2C[C@@H]3CN(C[C@H]3C2)C(=O)c2ccc3[nH]nnc3c2)cc1
: