Target
Ataxin-1
Ligand
BDBM446257
Substrate
Meas. Tech.
Human ATX Enzyme Inhibition Assay
IC50
3.00±n/a nM
Citation
 Hert, JHunziker, DMattei, PMauser, HTang, GWang, L Bicyclic derivatives US Patent  US10669268 Publication Date 6/2/2020 
Target
Name:
Ataxin-1
Synonyms:
ATX1 ATXN1 | SCA1
Type:
Protein
Mol. Mass.:
86941.25
Organism:
Homo sapiens (Human)
Description:
P54253
Residue:
815
  
Inhibitor
Name:
BDBM446257
Synonyms:
US10669268, Example 15.52
Type:
Small organic molecule
Emp. Form.:
C23H24F3N5O3
Mol. Mass.:
475.4636
SMILES:
FC(F)(F)Oc1ccc(\C=C\C(=O)N2C[C@@H]3CN(C[C@H]3C2)C(=O)C2CCc3[nH]nnc3C2)cc1
: