Target
Ataxin-1
Ligand
BDBM446357
Substrate
Meas. Tech.
Human ATX Enzyme Inhibition Assay
IC50
5.00±n/a nM
Citation
 Hert, JHunziker, DMattei, PMauser, HTang, GWang, L Bicyclic derivatives US Patent  US10669268 Publication Date 6/2/2020 
Target
Name:
Ataxin-1
Synonyms:
ATX1 ATXN1 | SCA1
Type:
Protein
Mol. Mass.:
86941.25
Organism:
Homo sapiens (Human)
Description:
P54253
Residue:
815
  
Inhibitor
Name:
BDBM446357
Synonyms:
(3aS,6aS)-5-((R)-4,5,6,7-tetrahydro-1H-benzotriazole-5-carbonyl)-hexahydro-pyrrolo[3,4-c]pyrrole-2-carboxylic acid 4-cyano-2-isopropyl-benzyl ester | US10669268, Example 4.46
Type:
Small organic molecule
Emp. Form.:
C25H30N6O3
Mol. Mass.:
462.5441
SMILES:
CC(C)c1cc(ccc1COC(=O)N1C[C@@H]2CN(C[C@H]2C1)C(=O)[C@@H]1CCc2[nH]nnc2C1)C#N
: