Target
Ataxin-1
Ligand
BDBM446362
Substrate
Meas. Tech.
Human ATX Enzyme Inhibition Assay
IC50
2.00±n/a nM
Citation
 Hert, JHunziker, DMattei, PMauser, HTang, GWang, L Bicyclic derivatives US Patent  US10669268 Publication Date 6/2/2020 
Target
Name:
Ataxin-1
Synonyms:
ATX1 ATXN1 | SCA1
Type:
Protein
Mol. Mass.:
86941.25
Organism:
Homo sapiens (Human)
Description:
P54253
Residue:
815
  
Inhibitor
Name:
BDBM446362
Synonyms:
(3aS,6aS)-5-((R)-4,5,6,7-tetrahydro-1H-benzotriazole-5-carbonyl)-hexahydro-pyrrolo[3,4-c]pyrrole-2-carboxylic acid 3-fluoro-4-trifluoromethoxy-benzyl ester | US10669268, Example 4.51
Type:
Small organic molecule
Emp. Form.:
C22H23F4N5O4
Mol. Mass.:
497.4427
SMILES:
Fc1cc(COC(=O)N2C[C@@H]3CN(C[C@H]3C2)C(=O)[C@@H]2CCc3[nH]nnc3C2)ccc1OC(F)(F)F
: