Target
Ataxin-1
Ligand
BDBM446371
Substrate
Meas. Tech.
Human ATX Enzyme Inhibition Assay
IC50
5.00±n/a nM
Citation
 Hert, JHunziker, DMattei, PMauser, HTang, GWang, L Bicyclic derivatives US Patent  US10669268 Publication Date 6/2/2020 
Target
Name:
Ataxin-1
Synonyms:
ATX1 ATXN1 | SCA1
Type:
Protein
Mol. Mass.:
86941.25
Organism:
Homo sapiens (Human)
Description:
P54253
Residue:
815
  
Inhibitor
Name:
BDBM446371
Synonyms:
(3aS,6aS)-5-((R)-4,5,6,7-tetrahydro-1H-benzotriazole-5-carbonyl)-hexahydro-pyrrolo[3,4-c]pyrrole-2-carboxylic acid 3-chloro-5-methanesulfonyl-benzyl ester | US10669268, Example 4.60
Type:
Small organic molecule
Emp. Form.:
C22H26ClN5O5S
Mol. Mass.:
507.99
SMILES:
CS(=O)(=O)c1cc(Cl)cc(COC(=O)N2C[C@@H]3CN(C[C@H]3C2)C(=O)[C@@H]2CCc3[nH]nnc3C2)c1
: