Target
Ataxin-1
Ligand
BDBM446421
Substrate
Meas. Tech.
Human ATX Enzyme Inhibition Assay
IC50
5.00±n/a nM
Citation
 Hert, JHunziker, DMattei, PMauser, HTang, GWang, L Bicyclic derivatives US Patent  US10669268 Publication Date 6/2/2020 
Target
Name:
Ataxin-1
Synonyms:
ATX1 ATXN1 | SCA1
Type:
Protein
Mol. Mass.:
86941.25
Organism:
Homo sapiens (Human)
Description:
P54253
Residue:
815
  
Inhibitor
Name:
BDBM446421
Synonyms:
1-[(3aR,6aR)-5-(1H-benzotriazole-5-carbonyl)-hexahydro-pyrrolo[3,4-c]pyrrol-2-yl]-3-(2-fluoro-4-trifluoromethyl-phenyl)-propan-1-one | US10669268, Example 19.19
Type:
Small organic molecule
Emp. Form.:
C23H21F4N5O2
Mol. Mass.:
475.4388
SMILES:
Fc1cc(ccc1CCC(=O)N1C[C@@H]2CN(C[C@H]2C1)C(=O)c1ccc2[nH]nnc2c1)C(F)(F)F
: