Target
Ataxin-1
Ligand
BDBM446405
Substrate
Meas. Tech.
Human ATX Enzyme Inhibition Assay
IC50
2.00±n/a nM
Citation
 Hert, JHunziker, DMattei, PMauser, HTang, GWang, L Bicyclic derivatives US Patent  US10669268 Publication Date 6/2/2020 
Target
Name:
Ataxin-1
Synonyms:
ATX1 ATXN1 | SCA1
Type:
Protein
Mol. Mass.:
86941.25
Organism:
Homo sapiens (Human)
Description:
P54253
Residue:
815
  
Inhibitor
Name:
BDBM446405
Synonyms:
4-{2-[(3aS,6aS)-5-(1H-benzotriazole-5-carbonyl)-hexahydro-pyrrolo[3,4-c]pyrrol-2-yl]-2-oxo-ethoxy}-3-isopropyl-benzonitrile US10669268, Example 19.22
Type:
Small organic molecule
Emp. Form.:
C25H26N6O3
Mol. Mass.:
458.5123
SMILES:
CC(C)c1cc(ccc1OCC(=O)N1C[C@@H]2CN(C[C@H]2C1)C(=O)c1ccc2[nH]nnc2c1)C#N
: