Target
Ataxin-1
Ligand
BDBM446428
Substrate
Meas. Tech.
Human ATX Enzyme Inhibition Assay
IC50
5.00±n/a nM
Citation
 Hert, JHunziker, DMattei, PMauser, HTang, GWang, L Bicyclic derivatives US Patent  US10669268 Publication Date 6/2/2020 
Target
Name:
Ataxin-1
Synonyms:
ATX1 ATXN1 | SCA1
Type:
Protein
Mol. Mass.:
86941.25
Organism:
Homo sapiens (Human)
Description:
P54253
Residue:
815
  
Inhibitor
Name:
BDBM446428
Synonyms:
1-[(3aR,6aR)-5-[(5R)-4,5,6,7-tetrahydro-1H-benzotriazole-5-carbonyl]-1,3,3a,4,6,6a-hexahydro-pyrrolo[3,4-c]pyrrol-2-yl]-3-[2-fluoro-4-(trifluoromethoxy)phenyl]-propan-1-one | US10669268, Example 19.26
Type:
Small organic molecule
Emp. Form.:
C23H25F4N5O3
Mol. Mass.:
495.4699
SMILES:
Fc1cc(OC(F)(F)F)ccc1CCC(=O)N1C[C@@H]2CN(C[C@H]2C1)C(=O)[C@@H]1CCc2[nH]nnc2C1
: