Target
Ataxin-1
Ligand
BDBM446434
Substrate
Meas. Tech.
Human ATX Enzyme Inhibition Assay
IC50
2.00±n/a nM
Citation
 Hert, JHunziker, DMattei, PMauser, HTang, GWang, L Bicyclic derivatives US Patent  US10669268 Publication Date 6/2/2020 
Target
Name:
Ataxin-1
Synonyms:
ATX1 ATXN1 | SCA1
Type:
Protein
Mol. Mass.:
86941.25
Organism:
Homo sapiens (Human)
Description:
P54253
Residue:
815
  
Inhibitor
Name:
BDBM446434
Synonyms:
4-[2-[(3aS,6aS)-5-(1H-benzotriazole-5-carbonyl)-1,3,3a,4,6,6a-hexahydropyrrolo[3,4-c]pyrrol-2-yl]-2-oxoethoxy]-3-tert-butylbenzonitrile | US10669268, Example 19.32
Type:
Small organic molecule
Emp. Form.:
C26H28N6O3
Mol. Mass.:
472.5389
SMILES:
CC(C)(C)c1cc(ccc1OCC(=O)N1C[C@@H]2CN(C[C@H]2C1)C(=O)c1ccc2[nH]nnc2c1)C#N
: