Target
Ataxin-1
Ligand
BDBM446386
Substrate
Meas. Tech.
Human ATX Enzyme Inhibition Assay
IC50
3.00±n/a nM
Citation
 Hert, JHunziker, DMattei, PMauser, HTang, GWang, L Bicyclic derivatives US Patent  US10669268 Publication Date 6/2/2020 
Target
Name:
Ataxin-1
Synonyms:
ATX1 ATXN1 | SCA1
Type:
Protein
Mol. Mass.:
86941.25
Organism:
Homo sapiens (Human)
Description:
P54253
Residue:
815
  
Inhibitor
Name:
BDBM446386
Synonyms:
US10669268, Example 15.90 | US10669268, Example 19.34
Type:
Small organic molecule
Emp. Form.:
C22H24F3N5O4
Mol. Mass.:
479.4523
SMILES:
FC(F)(F)Oc1ccc(OCC(=O)N2C[C@@H]3CN(C[C@H]3C2)C(=O)[C@@H]2CCc3[nH]nnc3C2)cc1
: