Target
Ataxin-1
Ligand
BDBM446438
Substrate
Meas. Tech.
Human ATX Enzyme Inhibition Assay
IC50
5.00±n/a nM
Citation
 Hert, JHunziker, DMattei, PMauser, HTang, GWang, L Bicyclic derivatives US Patent  US10669268 Publication Date 6/2/2020 
Target
Name:
Ataxin-1
Synonyms:
ATX1 ATXN1 | SCA1
Type:
Protein
Mol. Mass.:
86941.25
Organism:
Homo sapiens (Human)
Description:
P54253
Residue:
815
  
Inhibitor
Name:
BDBM446438
Synonyms:
1-[(3aS,6aS)-5-(1H-benzotriazole-5-carbonyl)-1,3,3a,4,6,6a-hexahydropyrrolo[3,4-c]pyrrol-2-yl]-2-(2-tert-butyl-4-methoxyphenoxy)ethanone | US10669268, Example 19.36
Type:
Small organic molecule
Emp. Form.:
C26H31N5O4
Mol. Mass.:
477.5554
SMILES:
COc1ccc(OCC(=O)N2C[C@@H]3CN(C[C@H]3C2)C(=O)c2ccc3[nH]nnc3c2)c(c1)C(C)(C)C
: