Target
Ataxin-1
Ligand
BDBM446440
Substrate
Meas. Tech.
Human ATX Enzyme Inhibition Assay
IC50
5.00±n/a nM
Citation
 Hert, JHunziker, DMattei, PMauser, HTang, GWang, L Bicyclic derivatives US Patent  US10669268 Publication Date 6/2/2020 
Target
Name:
Ataxin-1
Synonyms:
ATX1 ATXN1 | SCA1
Type:
Protein
Mol. Mass.:
86941.25
Organism:
Homo sapiens (Human)
Description:
P54253
Residue:
815
  
Inhibitor
Name:
BDBM446440
Synonyms:
((3aS,6aS)-5-(1H-benzo[d][1,2,3]tri-azole-5-carbonyl)hexahydro-pyrrolo[3,4-c]pyrrol-2(1H)-yl)(4-(2,2,2-trifluoroethoxy)quinolin-2-yl)methanone | US10669268, Example 19.38
Type:
Small organic molecule
Emp. Form.:
C25H21F3N6O3
Mol. Mass.:
510.4678
SMILES:
FC(F)(F)COc1cc(nc2ccccc12)C(=O)N1C[C@@H]2CN(C[C@H]2C1)C(=O)c1ccc2[nH]nnc2c1
: