Target
Thymidine kinase, cytosolic
Ligand
BDBM448384
Substrate
Meas. Tech.
Inhibition Assay
IC50
>10000±n/a nM
Citation
 Eckhardt, MGollner, ALangkopf, EWagner, HWiedenmayer, D Heteroaromatic carboxamide derivatives as plasma kallikrein inhibitors US Patent  US10695334 Publication Date 6/30/2020 
Target
Name:
Thymidine kinase, cytosolic
Synonyms:
KITH_HUMAN | TK1
Type:
PROTEIN
Mol. Mass.:
25476.50
Organism:
Homo sapiens (Human)
Description:
ChEMBL_1333884
Residue:
234
  
Inhibitor
Name:
BDBM448384
Synonyms:
7-[(6-{6,6-Difluoro-3-azabicyclo[3.1.0]hexan-3-yl}- | US10695334, Example 13
Type:
Small organic molecule
Emp. Form.:
C26H26F2N8O
Mol. Mass.:
504.5344
SMILES:
Cc1n[nH]c2[C@@H](CCc12)NC(=O)c1cn(Cc2ccc(nc2C)N2CC3C(C2)C3(F)F)c2ncncc12
: