Target
P2X purinoceptor 7
Ligand
BDBM398219
Substrate
Meas. Tech.
Pore Permeation Assay
IC50
55±n/a nM
Citation
 Karra, SR Indole derivatives and their use in neurodegenerative diseases US Patent  US10676433 Publication Date 6/9/2020 
Target
Name:
P2X purinoceptor 7
Synonyms:
ATP receptor P2RX7_HUMAN P2X purinoceptor 7 (P2X7) P2Z receptor | Purinergic receptor
Type:
Protein
Mol. Mass.:
68602.85
Organism:
Homo sapiens (Human)
Description:
Q99572
Residue:
595
  
Inhibitor
Name:
BDBM398219
Synonyms:
4-chloro-N-((3,3-difluoro-5-methylcyclohexyl)methyl)-1-(pyrrolidin-2-ylmethyl)-1H-indole-3-carboxamide US10676433, Compound 157
Type:
Small organic molecule
Emp. Form.:
C22H28ClF2N3O
Mol. Mass.:
423.927
SMILES:
CC1CC(CNC(=O)c2cn(CC3CCCN3)c3cccc(Cl)c23)CC(F)(F)C1
: