Target
Interleukin-1 beta
Ligand
BDBM398219
Substrate
Meas. Tech.
IL-1beta Release Assay
IC50
<10±n/a nM
Citation
 Karra, SR Indole derivatives and their use in neurodegenerative diseases US Patent  US10676433 Publication Date 6/9/2020 
Target
Name:
Interleukin-1 beta
Synonyms:
IL1B IL1F2 Interleukin-1 beta | hIL-1beta
Type:
Cytokine
Mol. Mass.:
30734.47
Organism:
Homo sapiens (Human)
Description:
P01584
Residue:
269
  
Inhibitor
Name:
BDBM398219
Synonyms:
4-chloro-N-((3,3-difluoro-5-methylcyclohexyl)methyl)-1-(pyrrolidin-2-ylmethyl)-1H-indole-3-carboxamide US10676433, Compound 157
Type:
Small organic molecule
Emp. Form.:
C22H28ClF2N3O
Mol. Mass.:
423.927
SMILES:
CC1CC(CNC(=O)c2cn(CC3CCCN3)c3cccc(Cl)c23)CC(F)(F)C1
: