Target
Ectonucleotide pyrophosphatase/phosphodiesterase family member 2
Ligand
BDBM450470
Substrate
Meas. Tech.
Human ATX Enzyme Inhibition Assay
IC50
10.00±n/a nM
Citation
 Hert, JHunziker, DKuratli, CMartin, REMattei, PSatz, AL Bicyclic quinazolinone derivatives US Patent  US10676446 Publication Date 6/9/2020 
Target
Name:
Ectonucleotide pyrophosphatase/phosphodiesterase family member 2
Synonyms:
ATX Autotaxin (ATX) ENPP2 Ectonucleotide Pyrophosphatase/Phosphodiesterase 2 (ENPP2) Extracellular lysophospholipase D PDNP2
Type:
Enzyme
Mol. Mass.:
99007.13
Organism:
Homo sapiens (Human)
Description:
Q13822
Residue:
863
  
Inhibitor
Name:
BDBM450470
Synonyms:
9H-Fluoren-9-ylmethyl 4-[3-[2-[(3,4-dichloro- phenyl)methyl- methylamino]-2- oxoethyl]-4- oxoquinazolin-6-yl] piperazine-1- carboxylate (intermediate A-6) and 1-(trifluoromethyl) cyclobutane-1- carboxylic acid ([CAS RN 277756-45- 3]) | US10676446, Example 76
Type:
Small organic molecule
Emp. Form.:
C28H28Cl2F3N5O3
Mol. Mass.:
610.455
SMILES:
CN(Cc1ccc(Cl)c(Cl)c1)C(=O)Cn1cnc2ccc(cc2c1=O)N1CCN(CC1)C(=O)C1(CCC1)C(F)(F)F
: