Target
Ectonucleotide pyrophosphatase/phosphodiesterase family member 2
Ligand
BDBM450573
Substrate
Meas. Tech.
Human ATX Enzyme Inhibition Assay
IC50
10.00±n/a nM
Citation
 Hert, JHunziker, DKuratli, CMartin, REMattei, PSatz, AL Bicyclic quinazolinone derivatives US Patent  US10676446 Publication Date 6/9/2020 
Target
Name:
Ectonucleotide pyrophosphatase/phosphodiesterase family member 2
Synonyms:
ATX Autotaxin (ATX) ENPP2 Ectonucleotide Pyrophosphatase/Phosphodiesterase 2 (ENPP2) Extracellular lysophospholipase D PDNP2
Type:
Enzyme
Mol. Mass.:
99007.13
Organism:
Homo sapiens (Human)
Description:
Q13822
Residue:
863
  
Inhibitor
Name:
BDBM450573
Synonyms:
N-[(3-Chloro-4- cyanophenyl)methyl]-N- methyl-2-(4-oxo-6- piperidin-4-ylquinazolin- 3-yl)acetamide (intermediate A-9) and (R)-2-hydroxy-3- methylbutanoic acid ([CAS RN 17407-56-6]) | US10676446, Example 157
Type:
Small organic molecule
Emp. Form.:
C29H32ClN5O4
Mol. Mass.:
550.048
SMILES:
CC(C)[C@@H](O)C(=O)N1CCC(CC1)c1ccc2ncn(CC(=O)N(C)Cc3ccc(C#N)c(Cl)c3)c(=O)c2c1
: