Target
Ectonucleotide pyrophosphatase/phosphodiesterase family member 2
Ligand
BDBM450589
Substrate
Meas. Tech.
Human ATX Enzyme Inhibition Assay
IC50
8.00±n/a nM
Citation
 Hert, JHunziker, DKuratli, CMartin, REMattei, PSatz, AL Bicyclic quinazolinone derivatives US Patent  US10676446 Publication Date 6/9/2020 
Target
Name:
Ectonucleotide pyrophosphatase/phosphodiesterase family member 2
Synonyms:
ATX Autotaxin (ATX) ENPP2 Ectonucleotide Pyrophosphatase/Phosphodiesterase 2 (ENPP2) Extracellular lysophospholipase D PDNP2
Type:
Enzyme
Mol. Mass.:
99007.13
Organism:
Homo sapiens (Human)
Description:
Q13822
Residue:
863
  
Inhibitor
Name:
BDBM450589
Synonyms:
N-[(3,4- Dichlorophenyl)methyl]-N- methyl-2-(4-oxo-6-piperidin-4- ylquinazolin-3-yl)acetamide (Example 165, step A) and 2- methoxypropanoic acid ([CAS RN 4324-37-2]) | US10676446, Example 173
Type:
Small organic molecule
Emp. Form.:
C27H30Cl2N4O4
Mol. Mass.:
545.458
SMILES:
COC(C)C(=O)N1CCC(CC1)c1ccc2ncn(CC(=O)N(C)Cc3ccc(Cl)c(Cl)c3)c(=O)c2c1
: