Target
Protein S100-A9
Ligand
BDBM299056
Substrate
Meas. Tech.
S100A9-RAGE inhibition assay
IC50
<1000±n/a nM
Citation
 Fritzson, ILiberg, DEast, SMackinnon, CPrevost, N N-(heteroaryl)-sulfonamide derivatives useful as S100-inhibitors US Patent  US10125125 Publication Date 11/13/2018 
Target
Name:
Protein S100-A9
Synonyms:
CAGB Calgranulin-B Leukocyte L1 complex heavy chain MRP14 S100 calcium-binding protein A9 S10A9_HUMAN | p14
Type:
Enzyme Catalytic Domain
Mol. Mass.:
13239.84
Organism:
Homo sapiens (Human)
Description:
Residue:
114
  
Inhibitor
Name:
BDBM299056
Synonyms:
N-(5-chloro-3-hydroxypyridin-2-yl)-1-(2,5-dichlorothiophen-3-yl)methane-sulfonamide | US10125125, Example 20
Type:
Small organic molecule
Emp. Form.:
C10H7Cl3N2O3S2
Mol. Mass.:
373.663
SMILES:
Oc1cc(Cl)cnc1NS(=O)(=O)Cc1cc(Cl)sc1Cl
: