Target
Protein S100-A9
Ligand
BDBM299069
Substrate
Meas. Tech.
S100A9-RAGE inhibition assay
IC50
980±n/a nM
Citation
 Fritzson, ILiberg, DEast, SMackinnon, CPrevost, N N-(heteroaryl)-sulfonamide derivatives useful as S100-inhibitors US Patent  US10125125 Publication Date 11/13/2018 
Target
Name:
Protein S100-A9
Synonyms:
CAGB Calgranulin-B Leukocyte L1 complex heavy chain MRP14 S100 calcium-binding protein A9 S10A9_HUMAN | p14
Type:
Enzyme Catalytic Domain
Mol. Mass.:
13239.84
Organism:
Homo sapiens (Human)
Description:
Residue:
114
  
Inhibitor
Name:
BDBM299069
Synonyms:
N-(6-chloro-4-hydroxypyridazin-3-yl)-1-(2-chloro-5-cyanophenyl)methane-sulfonamide | US10125125, Example 85
Type:
Small organic molecule
Emp. Form.:
C12H8Cl2N4O3S
Mol. Mass.:
359.188
SMILES:
Oc1cc(Cl)nnc1NS(=O)(=O)Cc1cc(ccc1Cl)C#N
: