Target
Protein S100-A9
Ligand
BDBM299070
Substrate
Meas. Tech.
S100A9-RAGE inhibition assay
IC50
>1000±n/a nM
Citation
 Fritzson, ILiberg, DEast, SMackinnon, CPrevost, N N-(heteroaryl)-sulfonamide derivatives useful as S100-inhibitors US Patent  US10125125 Publication Date 11/13/2018 
Target
Name:
Protein S100-A9
Synonyms:
CAGB Calgranulin-B Leukocyte L1 complex heavy chain MRP14 S100 calcium-binding protein A9 S10A9_HUMAN | p14
Type:
Enzyme Catalytic Domain
Mol. Mass.:
13239.84
Organism:
Homo sapiens (Human)
Description:
Residue:
114
  
Inhibitor
Name:
BDBM299070
Synonyms:
1-(3-chlorophenyl)-N-[5-(ethanesulfonyl)-3-hydroxypyrazin-2-yl]methane-sulfonamide | US10125125, Example 88
Type:
Small organic molecule
Emp. Form.:
C13H14ClN3O5S2
Mol. Mass.:
391.85
SMILES:
CCS(=O)(=O)c1cnc(NS(=O)(=O)Cc2cccc(Cl)c2)c(O)n1
: