Target
Protein S100-A9
Ligand
BDBM299077
Substrate
Meas. Tech.
S100A9-RAGE inhibition assay
IC50
<1000±n/a nM
Citation
 Fritzson, ILiberg, DEast, SMackinnon, CPrevost, N N-(heteroaryl)-sulfonamide derivatives useful as S100-inhibitors US Patent  US10125125 Publication Date 11/13/2018 
Target
Name:
Protein S100-A9
Synonyms:
CAGB Calgranulin-B Leukocyte L1 complex heavy chain MRP14 S100 calcium-binding protein A9 S10A9_HUMAN | p14
Type:
Enzyme Catalytic Domain
Mol. Mass.:
13239.84
Organism:
Homo sapiens (Human)
Description:
Residue:
114
  
Inhibitor
Name:
BDBM299077
Synonyms:
N-(5-cyano-3-hydroxypyrazin-2-yl)-1-(3,5-dichlorophenyl)methanesulfonamide | US10125125, Example 103
Type:
Small organic molecule
Emp. Form.:
C12H8Cl2N4O3S
Mol. Mass.:
359.188
SMILES:
Oc1nc(cnc1NS(=O)(=O)Cc1cc(Cl)cc(Cl)c1)C#N
: