Target
Protein S100-A9
Ligand
BDBM299080
Substrate
Meas. Tech.
S100A9-RAGE inhibition assay
IC50
420±n/a nM
Citation
 Fritzson, ILiberg, DEast, SMackinnon, CPrevost, N N-(heteroaryl)-sulfonamide derivatives useful as S100-inhibitors US Patent  US10125125 Publication Date 11/13/2018 
Target
Name:
Protein S100-A9
Synonyms:
CAGB Calgranulin-B Leukocyte L1 complex heavy chain MRP14 S100 calcium-binding protein A9 S10A9_HUMAN | p14
Type:
Enzyme Catalytic Domain
Mol. Mass.:
13239.84
Organism:
Homo sapiens (Human)
Description:
Residue:
114
  
Inhibitor
Name:
BDBM299080
Synonyms:
1-(3,5-dichlorophenyl)-N-(3-hydroxy-5-methanesulfonylpyrazin-2-yl)methane-sulfonamide | US10125125, Example 112
Type:
Small organic molecule
Emp. Form.:
C12H11Cl2N3O5S2
Mol. Mass.:
412.269
SMILES:
CS(=O)(=O)c1cnc(NS(=O)(=O)Cc2cc(Cl)cc(Cl)c2)c(O)n1
: