Target
Protein S100-A9
Ligand
BDBM299084
Substrate
Meas. Tech.
S100A9-RAGE inhibition assay
IC50
1110±n/a nM
Citation
 Fritzson, ILiberg, DEast, SMackinnon, CPrevost, N N-(heteroaryl)-sulfonamide derivatives useful as S100-inhibitors US Patent  US10125125 Publication Date 11/13/2018 
Target
Name:
Protein S100-A9
Synonyms:
CAGB Calgranulin-B Leukocyte L1 complex heavy chain MRP14 S100 calcium-binding protein A9 S10A9_HUMAN | p14
Type:
Enzyme Catalytic Domain
Mol. Mass.:
13239.84
Organism:
Homo sapiens (Human)
Description:
Residue:
114
  
Inhibitor
Name:
BDBM299084
Synonyms:
N-(5-chloro-3-hydroxypyridin-2-yl)-1-(5-cyanothiophen-3-yl)methanesulfonamide | US10125125, Example 127
Type:
Small organic molecule
Emp. Form.:
C11H8ClN3O3S2
Mol. Mass.:
329.783
SMILES:
Oc1cc(Cl)cnc1NS(=O)(=O)Cc1csc(c1)C#N
: