Target
Protein S100-A9
Ligand
BDBM299096
Substrate
Meas. Tech.
S100A9-RAGE inhibition assay
IC50
<1000±n/a nM
Citation
 Fritzson, ILiberg, DEast, SMackinnon, CPrevost, N N-(heteroaryl)-sulfonamide derivatives useful as S100-inhibitors US Patent  US10125125 Publication Date 11/13/2018 
Target
Name:
Protein S100-A9
Synonyms:
CAGB Calgranulin-B Leukocyte L1 complex heavy chain MRP14 S100 calcium-binding protein A9 S10A9_HUMAN | p14
Type:
Enzyme Catalytic Domain
Mol. Mass.:
13239.84
Organism:
Homo sapiens (Human)
Description:
Residue:
114
  
Inhibitor
Name:
BDBM299096
Synonyms:
1-(3,5-dichlorophenyl)-N-[5-hydroxy-2-(trifluoromethyl)pyrimidin-4-yl]methane-sulfonamide | US10125125, Example 157
Type:
Small organic molecule
Emp. Form.:
C12H8Cl2F3N3O3S
Mol. Mass.:
402.176
SMILES:
Oc1cnc(nc1NS(=O)(=O)Cc1cc(Cl)cc(Cl)c1)C(F)(F)F
: