Target
Protein S100-A9
Ligand
BDBM299099
Substrate
Meas. Tech.
S100A9-RAGE inhibition assay
IC50
>1000±n/a nM
Citation
 Fritzson, ILiberg, DEast, SMackinnon, CPrevost, N N-(heteroaryl)-sulfonamide derivatives useful as S100-inhibitors US Patent  US10125125 Publication Date 11/13/2018 
Target
Name:
Protein S100-A9
Synonyms:
CAGB Calgranulin-B Leukocyte L1 complex heavy chain MRP14 S100 calcium-binding protein A9 S10A9_HUMAN | p14
Type:
Enzyme Catalytic Domain
Mol. Mass.:
13239.84
Organism:
Homo sapiens (Human)
Description:
Residue:
114
  
Inhibitor
Name:
BDBM299099
Synonyms:
3-chloro-5-fluoro-N-[4-hydroxy-6-(trifluoromethyl)pyridazin-3-yl]benzene-1-sulfonamide | US10125125, Example 163
Type:
Small organic molecule
Emp. Form.:
C11H6ClF4N3O3S
Mol. Mass.:
371.695
SMILES:
Oc1cc(nnc1NS(=O)(=O)c1cc(F)cc(Cl)c1)C(F)(F)F
: