Target
Protein S100-A9
Ligand
BDBM299108
Substrate
Meas. Tech.
S100A9-RAGE inhibition assay
IC50
<1000±n/a nM
Citation
 Fritzson, ILiberg, DEast, SMackinnon, CPrevost, N N-(heteroaryl)-sulfonamide derivatives useful as S100-inhibitors US Patent  US10125125 Publication Date 11/13/2018 
Target
Name:
Protein S100-A9
Synonyms:
CAGB Calgranulin-B Leukocyte L1 complex heavy chain MRP14 S100 calcium-binding protein A9 S10A9_HUMAN | p14
Type:
Enzyme Catalytic Domain
Mol. Mass.:
13239.84
Organism:
Homo sapiens (Human)
Description:
Residue:
114
  
Inhibitor
Name:
BDBM299108
Synonyms:
N-(6-chloro-2-hydroxypyridin-3-yl)-1-[3-chloro-5-(ethylsulfanyl)phenyl]methane-sulfonamide | US10125125, Example 186
Type:
Small organic molecule
Emp. Form.:
C14H14Cl2N2O3S2
Mol. Mass.:
393.309
SMILES:
CCSc1cc(Cl)cc(CS(=O)(=O)Nc2ccc(Cl)nc2O)c1
: