Target
Lys-gingipain W83
Ligand
BDBM450998
Substrate
Meas. Tech.
Inhibition of Lysine Gingipain
IC50
>250±n/a nM
Citation
 Konradi, AWDominy, SSLynch, CCCoburn, CVacca, J Inhibitors of lysine gingipain US Patent  US10676470 Publication Date 6/9/2020 
Target
Name:
Lys-gingipain W83
Synonyms:
KGP83_PORGN Lysine specific cysteine protease Porphypain kgp prtP
Type:
Mol. Mass.:
187834.89
Organism:
Porphyromonas gingivalis
Description:
Q51817
Residue:
1732
  
Inhibitor
Name:
BDBM450998
Synonyms:
US10676470, Compound 44 | US11332464, Compound 44
Type:
Small organic molecule
Emp. Form.:
C17H25N3O2
Mol. Mass.:
303.3993
SMILES:
NCCCC[C@H](NC(=O)C1CCCC1)C(=O)c1ccccn1
: