Target
Receptor tyrosine-protein kinase erbB-2
Ligand
BDBM50165272
Substrate
Meas. Tech.
biochemical assay
IC50
365±45 nM
Citation
 Chiosis, GHe, HLlauger-Bufi, LKim, JLarson, SMSmith-Jones, P Small-molecule HSP90 inhibitors US Patent  US10676476 Publication Date 6/9/2020 
Target
Name:
Receptor tyrosine-protein kinase erbB-2
Synonyms:
2.7.10.1 CD_antigen=CD340 ERBB2_HUMAN FASN/HER2 HER2 MLN19 NEU Proto-oncogene Neu Tyrosine kinase-type cell surface receptor HER2 | p185erbB2
Type:
Mol. Mass.:
137894.47
Organism:
Homo sapiens (Human)
Description:
P04626
Residue:
1255
  
Inhibitor
Name:
BDBM50165272
Synonyms:
8-(6-Bromo-benzo[1,3]dioxol-5-ylsulfanyl)-9-pent-4-ynyl-9H-purin-6-ylamine CHEMBL365159 | US10676476, Example 1
Type:
Small organic molecule
Emp. Form.:
C17H14BrN5O2S
Mol. Mass.:
432.294
SMILES:
Nc1ncnc2n(CCCC#C)c(Sc3cc4OCOc4cc3Br)nc12
: