Target
Receptor tyrosine-protein kinase erbB-2
Ligand
BDBM50165315
Substrate
Meas. Tech.
biochemical assay
IC50
58000±1400 nM
Citation
 Chiosis, GHe, HLlauger-Bufi, LKim, JLarson, SMSmith-Jones, P Small-molecule HSP90 inhibitors US Patent  US10676476 Publication Date 6/9/2020 
Target
Name:
Receptor tyrosine-protein kinase erbB-2
Synonyms:
2.7.10.1 CD_antigen=CD340 ERBB2_HUMAN FASN/HER2 HER2 MLN19 NEU Proto-oncogene Neu Tyrosine kinase-type cell surface receptor HER2 | p185erbB2
Type:
Mol. Mass.:
137894.47
Organism:
Homo sapiens (Human)
Description:
P04626
Residue:
1255
  
Inhibitor
Name:
BDBM50165315
Synonyms:
9-Pent-4-ynyl-8-(2,4,5-trichloro-phenylsulfanyl)-9H-purin-6-ylamine US10676476, Example 2
Type:
Small organic molecule
Emp. Form.:
C16H12Cl3N5S
Mol. Mass.:
412.724
SMILES:
Nc1ncnc2n(CCCC#C)c(Sc3cc(Cl)c(Cl)cc3Cl)nc12
: