Target
Receptor tyrosine-protein kinase erbB-2
Ligand
BDBM50165313
Substrate
Meas. Tech.
biochemical assay
IC50
58300±2200 nM
Citation
 Chiosis, GHe, HLlauger-Bufi, LKim, JLarson, SMSmith-Jones, P Small-molecule HSP90 inhibitors US Patent  US10676476 Publication Date 6/9/2020 
Target
Name:
Receptor tyrosine-protein kinase erbB-2
Synonyms:
2.7.10.1 CD_antigen=CD340 ERBB2_HUMAN FASN/HER2 HER2 MLN19 NEU Proto-oncogene Neu Tyrosine kinase-type cell surface receptor HER2 | p185erbB2
Type:
Mol. Mass.:
137894.47
Organism:
Homo sapiens (Human)
Description:
P04626
Residue:
1255
  
Inhibitor
Name:
BDBM50165313
Synonyms:
8-(2,4-Dichloro-5-methoxy-phenylsulfanyl)-9-(2-isopropoxy-ethyl)-9H-purin-6-ylamine US10676476, Example 3
Type:
Small organic molecule
Emp. Form.:
C17H19Cl2N5O2S
Mol. Mass.:
428.336
SMILES:
COc1cc(Sc2nc3c(N)ncnc3n2CCOC(C)C)c(Cl)cc1Cl
: