Target
Heat shock protein HSP 90-alpha
Ligand
BDBM450875
Substrate
Meas. Tech.
biochemical assay
EC50
15400±2200 nM
Citation
 Chiosis, GHe, HLlauger-Bufi, LKim, JLarson, SMSmith-Jones, P Small-molecule HSP90 inhibitors US Patent  US10676476 Publication Date 6/9/2020 
Target
Name:
Heat shock protein HSP 90-alpha
Synonyms:
HS90A_HUMAN HSP86 HSP90AA1 HSPCA Heat shock 86 kDa Heat shock protein HSP 90-alpha (HSP90) LAP-2 Lipopolysaccharide-associated protein 2 heat shock protein 90kDa alpha (cytosolic), class A member 1 isoform 2
Type:
Molecular Chaperone
Mol. Mass.:
84623.45
Organism:
Homo sapiens (Human)
Description:
P07900
Residue:
732
  
Inhibitor
Name:
BDBM450875
Synonyms:
US10676476, Example 4
Type:
Small organic molecule
Emp. Form.:
C11H6Cl3N5S
Mol. Mass.:
346.623
SMILES:
Nc1ncnc2[nH]c(Sc3cc(Cl)c(Cl)cc3Cl)nc12
: