Target
Receptor tyrosine-protein kinase erbB-2
Ligand
BDBM450875
Substrate
Meas. Tech.
biochemical assay
IC50
47800±3200 nM
Citation
 Chiosis, GHe, HLlauger-Bufi, LKim, JLarson, SMSmith-Jones, P Small-molecule HSP90 inhibitors US Patent  US10676476 Publication Date 6/9/2020 
Target
Name:
Receptor tyrosine-protein kinase erbB-2
Synonyms:
2.7.10.1 CD_antigen=CD340 ERBB2_HUMAN FASN/HER2 HER2 MLN19 NEU Proto-oncogene Neu Tyrosine kinase-type cell surface receptor HER2 | p185erbB2
Type:
Mol. Mass.:
137894.47
Organism:
Homo sapiens (Human)
Description:
P04626
Residue:
1255
  
Inhibitor
Name:
BDBM450875
Synonyms:
US10676476, Example 4
Type:
Small organic molecule
Emp. Form.:
C11H6Cl3N5S
Mol. Mass.:
346.623
SMILES:
Nc1ncnc2[nH]c(Sc3cc(Cl)c(Cl)cc3Cl)nc12
: