Target
Receptor tyrosine-protein kinase erbB-2
Ligand
BDBM50180306
Substrate
Meas. Tech.
biochemical assay
IC50
205±15 nM
Citation
 Chiosis, GHe, HLlauger-Bufi, LKim, JLarson, SMSmith-Jones, P Small-molecule HSP90 inhibitors US Patent  US10676476 Publication Date 6/9/2020 
Target
Name:
Receptor tyrosine-protein kinase erbB-2
Synonyms:
2.7.10.1 CD_antigen=CD340 ERBB2_HUMAN FASN/HER2 HER2 MLN19 NEU Proto-oncogene Neu Tyrosine kinase-type cell surface receptor HER2 | p185erbB2
Type:
Mol. Mass.:
137894.47
Organism:
Homo sapiens (Human)
Description:
P04626
Residue:
1255
  
Inhibitor
Name:
BDBM50180306
Synonyms:
8-(6-BROMO-BENZO[1,3]DIOXOL-5-YLSULFANYL)-9-(3-ISOPROPYLAMINO-PROPYL)-ADENINE CHEMBL383189 US10676476, Example 5
Type:
Small organic molecule
Emp. Form.:
C18H21BrN6O2S
Mol. Mass.:
465.367
SMILES:
CC(C)NCCCn1c(Sc2cc3OCOc3cc2Br)nc2c(N)ncnc12
: