Target
Receptor tyrosine-protein kinase erbB-2
Ligand
BDBM50180310
Substrate
Meas. Tech.
biochemical assay
IC50
210±10 nM
Citation
 Chiosis, GHe, HLlauger-Bufi, LKim, JLarson, SMSmith-Jones, P Small-molecule HSP90 inhibitors US Patent  US10676476 Publication Date 6/9/2020 
Target
Name:
Receptor tyrosine-protein kinase erbB-2
Synonyms:
2.7.10.1 CD_antigen=CD340 ERBB2_HUMAN FASN/HER2 HER2 MLN19 NEU Proto-oncogene Neu Tyrosine kinase-type cell surface receptor HER2 | p185erbB2
Type:
Mol. Mass.:
137894.47
Organism:
Homo sapiens (Human)
Description:
P04626
Residue:
1255
  
Inhibitor
Name:
BDBM50180310
Synonyms:
2-fluoro-8-(6-bromo-benzo[1,3]dioxol-5-ylmethyl)-9-(pent-4-ynyl)adenine US10676476, Example 6
Type:
Small organic molecule
Emp. Form.:
C18H15BrFN5O2
Mol. Mass.:
432.246
SMILES:
Nc1nc(F)nc2n(CCCC#C)c(Cc3cc4OCOc4cc3Br)nc12
: